AO
type: Concept
top concept of: scheme
in scheme: scheme
preferred label: Autorenversion @de
preferred label: versione originale dell'autore @it
preferred label: version originale @fr
preferred label: auteurs versie @nl
preferred label: Yazarın orijinal versiyonu @tr
preferred label: versión original del autor @es
preferred label: versió de l'autor @ca
preferred label: 著者オリジナル版 @ja
preferred label: 作者手稿 @zh
preferred label: авторский оригинал @ru
preferred label: käsikirjoitus @fi
preferred label: autorski original @sr
preferred label: ауторски оригинал @sr-cyrl
alternative label: author's original
alternative label: draft
alternative label: preprint version
alternative label: version d'origine @fr
alternative label: première version @fr
alternative label: Ön baskı @tr
alternative label: borrador @es
alternative label: manuscrito @es
alternative label: versió original de l'autor @ca
alternative label: esborrany @ca
alternative label: manuscrit @ca
alternative label: 论文二次审定稿、论文审定稿 @zh
alternative label: оригинал @ru
change note:
  comment: Catalan translations were added. Broken matching link was removed: http://purl.org/info:eu-repo/semantics/authorVersion
  creator: Ilkay Holt
  modified: 2021-06-18T14:18:35+00:00
change note:
  comment: Finnish translation was added.
  creator: Ilkay Holt
  modified: 2021-08-17T18:54:22+00:00
change note:
  comment: Serbian translation was added.
  creator: Milica Sevkusic
  modified: 2022-04-11T21:53:19+00:00
definition: Any version of a resource that is considered by the author to be of sufficient quality to be submitted for formal peer review by a second party. The author accepts full responsibility for the resource . May have a version number or date stamp. Content and layout as set out by the author. (adapted from NISO-JAV, https://www.niso.org/publications/niso-rp-8-2008-jav)
editorial note: Chinese translations added July 2022