AM
type: Concept
top concept of: scheme
in scheme: scheme
preferred label: akzeptiertes Manuskript @de
preferred label: versione accettata per la pubblicazione @it
preferred label: version acceptée @fr
preferred label: geaccepteerde versie @nl
preferred label: Yayına kabul edilmiş versiyon @tr
preferred label: versión final del autor @es
preferred label: versió acceptada per publicar @ca
preferred label: 出版社受理版 @ja
preferred label: 作者投审稿 @zh
preferred label: материал принятый к публикации @ru
preferred label: julkaisukelpoinen versio @fi
preferred label: verzija prihvaćena za objavljivanje @sr
preferred label: верзија прихваћена за објављивање @sr-cyrl
alternative label: postprint version
alternative label: accepted version
alternative label: accepted manuscript
alternative label: Post-Print @de
alternative label: postprint @fr
alternative label: postpublication @fr
alternative label: versión aceptada para publicar @es
alternative label: manuscrito aceptado @es
alternative label: versió final de l'autor @ca
alternative label: versió acceptada @ca
alternative label: 出版社受理稿、后印本稿 @zh
alternative label: статья принятая к публикации @ru
alternative label: рукопись принятая к публикации @ru
alternative label: материалы принятые к публикации @ru
alternative label: принятая к публикации рукопись @ru
alternative label: recenzirana verzija @sr
alternative label: рецензирана верзија @sr-cyrl
change note:
  comment: Catalan translation was added. Broken matching link was removed: http://purl.org/info:eu-repo/semantics/acceptedVersion
  creator: Ilkay Holt
  modified: 2021-06-18T14:16:32+00:00
change note:
  comment: Finnish translation was added.
  creator: Ilkay Holt
  modified: 2021-08-17T18:55:46+00:00
change note:
  comment: Serbian translation was added.
  creator: Milica Sevkusic
  modified: 2022-04-11T21:55:16+00:00
definition: The version of a resource that has been accepted for publication. A second party takes permanent responsibility for the resource. Content and layout follow publisher’s submission requirements. (adapted from NISO-JAV, https://www.niso.org/publications/niso-rp-8-2008-jav)
editorial note: Chinese translations added July 2022