SMUR
type: Concept
top concept of: scheme
in scheme: scheme
preferred label: eingereichte Version @de
preferred label: versione sottoposta a revisione @it
preferred label: version soumise @fr
preferred label: ingediende versie @nl
preferred label: Hakem değerlendirmesi için gönderilmiş versiyon @tr
preferred label: versión sometida a revisión @es
preferred label: versió sotmesa a revisió @ca
preferred label: 査読版 @ja
preferred label: 预印本稿 @zh
preferred label: на рассмотрении на предмет публикации @ru
preferred label: artikkelin ennakkoversio @fi
preferred label: nerecenziranа verzija @sr
preferred label: нерецензирана верзија @sr-cyrl
alternative label: submitted manuscript under review
alternative label: submitted version
alternative label: prépublication @fr
alternative label: preprint @fr
alternative label: versión enviada a revisión @es
alternative label: versión enviada al editor @es
alternative label: versión enviada a revisión por pares @es
alternative label: versión no evaluada por pares @es
alternative label: versió no avaluada per experts @ca
alternative label: versió enviada a revisió @ca
alternative label: 正式提交稿、出版前送审稿、出版社编修稿、审读稿 @zh
alternative label: на рассмотрении журнала @ru
alternative label: на рассмотрении в редакции @ru
alternative label: рукопись принятая к рассмотрению @ru
alternative label: nerecenzirani rukopis @sr
alternative label: нерецензирани рукопис @sr-cyrl
change note:
  comment: Catalan translations were added. Broken matching link was removed: http://purl.org/info:eu-repo/semantics/submittedVersion
  creator: Ilkay Holt
  modified: 2021-06-18T14:27:51+00:00
change note:
  comment: Finnish translation was added.
  creator: Ilkay Holt
  modified: 2021-08-17T18:55:09+00:00
change note:
  comment: Chinese translation was added.
  creator: Milica Sevkusic
  modified: 2022-04-11T08:43:05+00:00
definition: Any version of a resource that is under formal review managed by a socially recognized publishing entity. The entity recognizes its responsibility to provide objective expert review and feedback to the author, and, ultimately, to pass judgment on the fitness of the resource for publication with an “accept” or “reject” decision. May have a version number or date stamp. Content and layout follow publisher’s submission requirements. (adapted from NISO-JAV, https://www.niso.org/publications/niso-rp-8-2008-jav)