VoR
type: Concept
top concept of: scheme
in scheme: scheme
preferred label: Erstpublikation @de
preferred label: versione pubblicata @it
preferred label: version publiée @fr
preferred label: gepubliceerde versie @nl
preferred label: Yayıncı versiyonu @tr
preferred label: versión publicada @es
preferred label: versió publicada @ca
preferred label: 出版社版 @ja
preferred label: 出版稿 @zh
preferred label: версия публикации @ru
preferred label: julkaistu versio @fi
preferred label: objavljena verzija @sr
preferred label: објављена верзија @sr-cyrl
alternative label: publisher version
alternative label: version of record
alternative label: originale Verlagspublikation @de
alternative label: version finale @fr
alternative label: reprint @fr
alternative label: version éditée @fr
alternative label: versie @nl
alternative label: versión final del editor @es
alternative label: versió final de l'editor @ca
alternative label: 论文处理稿、论文编修记录、论文永久保存稿 @zh
alternative label: версия записи @ru
alternative label: версия данных @ru
alternative label: коначна објављена верзија @sr
change note:
  comment: Catalan translations were added. Broken matching link was removed: http://purl.org/info:eu-repo/semantics/publishedVersion
  creator: Ilkay Holt
  modified: 2021-06-18T14:28:51+00:00
change note:
  comment: Finnish translation was added.
  creator: Ilkay Holt
  modified: 2021-08-17T18:57:45+00:00
change note:
  comment: Serbian translation was added.
  creator: Milica Sevkusic
  modified: 2022-04-11T08:38:20+00:00
change note:
  creator: Isabel Bernal
  modified: 2022-09-28T14:18:01+00:00
definition: A fixed version of a resource that has been made available by any organization that acts as a publisher by formally and exclusively declaring the resource “published”. This includes any “early release” resource that is formally identified as being published even before the compilation of a volume issue and assignment of associated metadata, as long as it is citable via some permanent identifier(s). This does not include any “early release” resource that has not yet been “fixed” by processes that are still to be applied, such as copy-editing, proof corrections, layout, and typesetting. (adapted from NISO-JAV, https://www.niso.org/publications/niso-rp-8-2008-jav)
editorial note: Chinese translations added in July 2022